Reaction Details
TargetDipeptidyl peptidase 8
LigandBDBM12183
Substrate/CompetitorBDBM11526
Meas. Tech.Enzyme Inhibition Assay
pH8±n/a
Temperature310.15±n/a K
IC50 16±n/a nM
Citation Jiaang, WTChen, YSHsu, TWu, SHChien, CHChang, CNChang, SPLee, SJChen, X Novel isoindoline compounds for potent and selective inhibition of prolyl dipeptidase DPP8. Bioorg Med Chem Lett15:687-91 (2005) 
 
Dipeptidyl peptidase 8
Name:Dipeptidyl peptidase 8
Type:Enzyme
Mol. Mass.:103342.62
Organism:Homo sapiens (Human)
Description:Q6V1X1
Residue:898
BDBM12183
BDBM11526
NameBDBM12183
Synonyms:(2S)-1-[(2S)-2-amino-4-{4-[bis(4-fluorophenyl)methyl]piperazin-1-yl}-4-oxobutanoyl]pyrrolidine-2-carbonitrile cyanopyrrolidine derivative 6
TypeSmall organic molecule
Emp. Form.C26H29F2N5O2
Mol. Mass.481.5376
SMILESN[C@@H](CC(=O)N1CCN(CC1)C(c1ccc(F)cc1)c1ccc(F)cc1)C(=O)N1CCC[C@H]1C#N