Reaction Details
TargetDipeptidyl peptidase 8
LigandBDBM12192
Substrate/CompetitorBDBM11526
Meas. Tech.Enzyme Inhibition Assay
pH8±n/a
Temperature310.15±n/a K
IC50 24±n/a nM
Citation Jiaang, WTChen, YSHsu, TWu, SHChien, CHChang, CNChang, SPLee, SJChen, X Novel isoindoline compounds for potent and selective inhibition of prolyl dipeptidase DPP8. Bioorg Med Chem Lett15:687-91 (2005) 
 
Dipeptidyl peptidase 8
Name:Dipeptidyl peptidase 8
Type:Enzyme
Mol. Mass.:103342.62
Organism:Homo sapiens (Human)
Description:Q6V1X1
Residue:898
BDBM12192
BDBM11526
NameBDBM12192
Synonyms:(2S)-2-amino-2-cyclohexyl-1-(2,3-dihydro-1H-isoindol-2-yl)ethan-1-one US11559537, Compound 3360-C | isoquinoline derivative 15
TypeSmall organic molecule
Emp. Form.C16H22N2O
Mol. Mass.258.3587
SMILESN[C@@H](C1CCCCC1)C(=O)N1Cc2ccccc2C1