Reaction Details
TargetDipeptidyl peptidase 8
LigandBDBM12195
Substrate/CompetitorBDBM11526
Meas. Tech.Enzyme Inhibition Assay
pH8±n/a
Temperature310.15±n/a K
IC50 14±n/a nM
Citation Jiaang, WTChen, YSHsu, TWu, SHChien, CHChang, CNChang, SPLee, SJChen, X Novel isoindoline compounds for potent and selective inhibition of prolyl dipeptidase DPP8. Bioorg Med Chem Lett15:687-91 (2005) 
 
Dipeptidyl peptidase 8
Name:Dipeptidyl peptidase 8
Type:Enzyme
Mol. Mass.:103342.62
Organism:Homo sapiens (Human)
Description:Q6V1X1
Residue:898
BDBM12195
BDBM11526
NameBDBM12195
Synonyms:2-amino-4-{4-[bis(4-fluorophenyl)methyl]piperazin-1-yl}-1-(2,3-dihydro-1H-isoindol-2-yl)butane-1,4-dione | isoquinoline derivative 18
TypeSmall organic molecule
Emp. Form.C29H30F2N4O2
Mol. Mass.504.5709
SMILESNC(CC(=O)N1CCN(CC1)C(c1ccc(F)cc1)c1ccc(F)cc1)C(=O)N1Cc2ccccc2C1