Reaction Details
TargetVasopressin V1b receptor
LigandBDBM260206
Substrate/Competitorn/a
Meas. Tech.Binding Test for V1b Receptor
pH7.4±n/a
Temperature298.15±n/a K
IC50 0.820±n/a nM
Commentsextracted
Citation Yoshinaga, MKuwada, TMiyakoshi, NIshizaka, TWakasugi, DShirokawa, SHattori, NShimazaki, Y Azole derivative US Patent US9522914 Publication Date 12/20/2016
 
Vasopressin V1b receptor
Name:Vasopressin V1b receptor
Type:Enzyme
Mol. Mass.:46985.01
Organism:Homo sapiens (Human)
Description:P47901
Residue:424
BDBM260206
NameBDBM260206
Synonyms:US9522914, A-08
TypeSmall organic molecule
Emp. Form.C28H33ClN4O2
Mol. Mass.493.04
SMILESCC(C)NC(=O)Cn1cc(nc1-c1cccc(Cl)c1)-c1ccc(CCN2C3CCC2COC3)cc1