Reaction Details
TargetVasopressin V1b receptor
LigandBDBM260241
Substrate/Competitorn/a
Meas. Tech.Binding Test for V1b Receptor
pH7.4±n/a
Temperature298.15±n/a K
IC50 0.490±n/a nM
Commentsextracted
Citation Yoshinaga, MKuwada, TMiyakoshi, NIshizaka, TWakasugi, DShirokawa, SHattori, NShimazaki, Y Azole derivative US Patent US9522914 Publication Date 12/20/2016
 
Vasopressin V1b receptor
Name:Vasopressin V1b receptor
Type:Enzyme
Mol. Mass.:46985.01
Organism:Homo sapiens (Human)
Description:P47901
Residue:424
BDBM260241
NameBDBM260241
Synonyms:US9522914, A-43
TypeSmall organic molecule
Emp. Form.C26H30ClFN4O2
Mol. Mass.484.993
SMILESCC(C)NC(=O)Cn1cc(nc1-c1cccc(Cl)c1)-c1ccc(CCN2CCOCC2)cc1F