Reaction Details
TargetVasopressin V1b receptor
LigandBDBM260267
Substrate/Competitorn/a
Meas. Tech.Binding Test for V1b Receptor
pH7.4±n/a
Temperature298.15±n/a K
IC50 0.430±n/a nM
Commentsextracted
Citation Yoshinaga, MKuwada, TMiyakoshi, NIshizaka, TWakasugi, DShirokawa, SHattori, NShimazaki, Y Azole derivative US Patent US9522914 Publication Date 12/20/2016
 
Vasopressin V1b receptor
Name:Vasopressin V1b receptor
Type:Enzyme
Mol. Mass.:46985.01
Organism:Homo sapiens (Human)
Description:P47901
Residue:424
BDBM260267
NameBDBM260267
Synonyms:US9522914, B-20
TypeSmall organic molecule
Emp. Form.C29H37N5O3
Mol. Mass.503.6358
SMILESCOc1cccc(c1)-c1nc(nn1CC(=O)NC(C)C)-c1ccc(CC(C)N2C3CCC2COC3)cc1