Reaction Details
TargetBromodomain-containing protein 4 [1-477]/[333-460]/[44-168]/[44-460]
LigandBDBM331215
Substrate/Competitorn/a
Meas. Tech.Time Resolved Fluorescence Resonance Energy Transfer (TR-FRET) Assay
IC50<1±n/a nM
Citation Norris, DJVaccaro, WDeBenedetto, MVDegnan, APDelucca, GVDeskus, JAHan, WKumi, GKSchmitz, WDStarrett, Jr., JEHill, MDHuang, H Tricyclic compounds as anticancer agents US Patent US9725449 Publication Date 8/8/2017
 
Bromodomain-containing protein 4 [1-477]/[333-460]/[44-168]/[44-460]
Name:Bromodomain-containing protein 4 [1-477]/[333-460]/[44-168]/[44-460]
Synonyms:Bromodomain BRD4
Type:Protein
Mol. Mass.:n/a
Description:n/a
Components:This complex has 4 components.
Component 1
Name:Bromodomain-containing protein 4 [44-168]
Type:Enzyme Catalytic Domain
Mol. Mass.:14866.49
Organism:Homo sapiens (Human)
Description:aa (44-168)
Residue:125
Component 2
Name:Bromodomain-containing protein 4 [333-460]
Synonyms:BET bromodomain 4(2) (BRD4(2)) BRD4_HUMAN HUNK1
Type:Enzyme Catalytic Domain
Mol. Mass.:14818.38
Organism:Homo sapiens (Human)
Description:aa (333-460)
Residue:128
Component 3
Name:Bromodomain-containing protein 4 [1-477]
Synonyms:BRD4 Bromodomain-containing protein 4 (BRD4 (aa 1-477) HUNK1
Type:Enzyme Catalytic Domain
Mol. Mass.:53061.90
Organism:Homo sapiens (Human)
Description:aa (1-477)
Residue:477
Component 4
Name:Bromodomain-containing protein 4 [44-460]
Synonyms:BRD4 Bromodomain-containing protein 4 (BRD4) | HUNK1
Type:Enzyme Catalytic Domain
Mol. Mass.:47039.29
Organism:Homo sapiens (Human)
Description:aa (44-460)
Residue:417
BDBM331215
NameBDBM331215
Synonyms:5-(Dimethyl-1,2-oxazol-4-yl)-8-[(S)-(4-fluorophenyl)(oxan-4-yl)methyl]-10-methanesulfonyl-13-methoxy-3,8,12-triazatricyclo[7.4.0.02,7]trideca-1(13),2 US9725449, Example 55
TypeSmall organic molecule
Emp. Form.C29H29FN4O5S
Mol. Mass.564.628
SMILESCOc1ncc(c2n([C@@H](C3CCOCC3)c3ccc(F)cc3)c3cc(cnc3c12)-c1c(C)noc1C)S(C)(=O)=O