Reaction Details
TargetCathepsin K
LigandBDBM331621
Substrate/Competitorn/a
Meas. Tech.Enzyme Assay
Ki 1.000±n/a nM
Citation Nardi, ARatcliffe, PCraan, THertrampf, TLesch, BKime, RSteinhagen, H 3-oxo-tetrahydro-furo[3,2-B]pyrrol-4(5H)-yl) derivatives I US Patent US9725459 Publication Date 8/8/2017
 
Cathepsin K
Name:Cathepsin K
Type:Enzyme
Mol. Mass.:36975.68
Organism:Homo sapiens (Human)
Description:P43235
Residue:329
BDBM331621
NameBDBM331621
Synonyms:N-((S)-2-((3aS,6S,6aS)-6-chloro-3- oxotetrahydro-2H-furo[3,2-b]pyrrol-4(5H)-yl)- 1-cyclohexyl-2-oxoethyl)-5-(2-ethylpyridin-4- yl)thiophene-2-carboxamide | US9725459, 86
TypeSmall organic molecule
Emp. Form.C26H30ClN3O4S
Mol. Mass.516.052
SMILESCCc1cc(ccn1)-c1ccc(s1)C(=O)N[C@@H](C1CCCCC1)C(=O)N1C[C@H](Cl)[C@H]2OCC(=O)[C@@H]12