Reaction Details
TargetCoagulation factor X
LigandBDBM12391
Substrate/CompetitorBDBM12500
Meas. Tech.Factor Xa Inhibition Assay
Ki 2±n/a nM
Citation Nazare, MWill, DWMatter, HSchreuder, HRitter, KUrmann, MEssrich, MBauer, AWagner, MCzech, JLorenz, MLaux, VWehner, V Probing the subpockets of factor Xa reveals two binding modes for inhibitors based on a 2-carboxyindole scaffold: a study combining structure-activity relationship and X-ray crystallography. J Med Chem48:4511-25 (2005) 
 
Coagulation factor X
Name:Coagulation factor X
Type:Enzyme
Mol. Mass.:54726.60
Organism:Homo sapiens (Human)
Description:n/a
Residue:488
BDBM12391
BDBM12500
NameBDBM12391
Synonyms:2-Carboxyindole Scaffold 23 3-chloro-1-{[5-(5-chlorothiophen-2-yl)-1,2-oxazol-3-yl]methyl}-N-[1-(propan-2-yl)piperidin-4-yl]-1H-indole-2-carboxamide
TypeSmall organic molecule
Emp. Form.C25H26Cl2N4O2S
Mol. Mass.517.471
SMILESCC(C)N1CCC(CC1)NC(=O)c1c(Cl)c2ccccc2n1Cc1cc(on1)-c1ccc(Cl)s1