Reaction Details
TargetCoagulation factor X
LigandBDBM12394
Substrate/CompetitorBDBM12500
Meas. Tech.Factor Xa Inhibition Assay
Ki 55±n/a nM
Citation Nazare, MWill, DWMatter, HSchreuder, HRitter, KUrmann, MEssrich, MBauer, AWagner, MCzech, JLorenz, MLaux, VWehner, V Probing the subpockets of factor Xa reveals two binding modes for inhibitors based on a 2-carboxyindole scaffold: a study combining structure-activity relationship and X-ray crystallography. J Med Chem48:4511-25 (2005) 
 
Coagulation factor X
Name:Coagulation factor X
Type:Enzyme
Mol. Mass.:54726.60
Organism:Homo sapiens (Human)
Description:n/a
Residue:488
BDBM12394
BDBM12500
NameBDBM12394
Synonyms:1-[5-(5-Chloro-thiophen-2-yl)-isoxazol-3-ylmethyl]-3-phenyl-1H-indole-2-carboxylic acid (1-isopropyl-piperidin-4-yl)-amide 2-Carboxyindole Scaffold 40
TypeSmall organic molecule
Emp. Form.C31H31ClN4O2S
Mol. Mass.559.121
SMILESCC(C)N1CCC(CC1)NC(=O)c1c(-c2ccccc2)c2ccccc2n1Cc1cc(on1)-c1ccc(Cl)s1