Reaction Details
TargetE3 ubiquitin-protein ligase SMURF1
LigandBDBM239100
Substrate/Competitorn/a
Meas. Tech.Pharmaceutical Assay
IC50 64.0±n/a nM
Citation Bala, KJBrearley, ADale, JEdwards, AAhmed, MPorter, DPulz, RARooney, LASandham, DAShaw, DSmith, NTaylor, JLTaylor, RJTroxler, TJWrigglesworth, J Carboxamide derivatives US Patent US10195181 Publication Date 2/5/2019
 
E3 ubiquitin-protein ligase SMURF1
Name:E3 ubiquitin-protein ligase SMURF1
Type:PROTEIN
Mol. Mass.:86120.64
Organism:Homo sapiens (Human)
Description:ChEMBL_116984
Residue:757
BDBM239100
NameBDBM239100
Synonyms:US10195181, Example 2.1 | US9403810, 2.1
TypeSmall organic molecule
Emp. Form.C25H34N4O4
Mol. Mass.454.5619
SMILESCc1c(noc1C1=CCC2(CCCO2)CC1)C(=O)Nc1c(C)n(C)n(C2CCCCC2)c1=O