Reaction Details
TargetE3 ubiquitin-protein ligase SMURF1
LigandBDBM239101
Substrate/Competitorn/a
Meas. Tech.Pharmaceutical Assay
IC50 0.900±n/a nM
Citation Bala, KJBrearley, ADale, JEdwards, AAhmed, MPorter, DPulz, RARooney, LASandham, DAShaw, DSmith, NTaylor, JLTaylor, RJTroxler, TJWrigglesworth, J Carboxamide derivatives US Patent US10195181 Publication Date 2/5/2019
 
E3 ubiquitin-protein ligase SMURF1
Name:E3 ubiquitin-protein ligase SMURF1
Type:PROTEIN
Mol. Mass.:86120.64
Organism:Homo sapiens (Human)
Description:ChEMBL_116984
Residue:757
BDBM239101
NameBDBM239101
Synonyms:US10195181, Example 2.2 | US9403810, 2.2
TypeSmall organic molecule
Emp. Form.C24H34N4O3
Mol. Mass.426.5518
SMILESCc1c(noc1C1=CCC(C)(C)CC1)C(=O)Nc1c(C)n(C)n(C2CCCCC2)c1=O