Reaction Details
TargetE3 ubiquitin-protein ligase SMURF1
LigandBDBM239102
Substrate/Competitorn/a
Meas. Tech.Pharmaceutical Assay
IC50 6.00±n/a nM
Citation Bala, KJBrearley, ADale, JEdwards, AAhmed, MPorter, DPulz, RARooney, LASandham, DAShaw, DSmith, NTaylor, JLTaylor, RJTroxler, TJWrigglesworth, J Carboxamide derivatives US Patent US10195181 Publication Date 2/5/2019
 
E3 ubiquitin-protein ligase SMURF1
Name:E3 ubiquitin-protein ligase SMURF1
Type:PROTEIN
Mol. Mass.:86120.64
Organism:Homo sapiens (Human)
Description:ChEMBL_116984
Residue:757
BDBM239102
NameBDBM239102
Synonyms:US10195181, Example 3 | US9403810, 3
TypeSmall organic molecule
Emp. Form.C23H32N4O3
Mol. Mass.412.5252
SMILESCc1c(noc1C1=CCC(C)(C)C1)C(=O)Nc1c(C)n(C)n(C2CCCCC2)c1=O