Reaction Details
TargetE3 ubiquitin-protein ligase SMURF1
LigandBDBM239111
Substrate/Competitorn/a
Meas. Tech.Pharmaceutical Assay
IC50 420±n/a nM
Citation Bala, KJBrearley, ADale, JEdwards, AAhmed, MPorter, DPulz, RARooney, LASandham, DAShaw, DSmith, NTaylor, JLTaylor, RJTroxler, TJWrigglesworth, J Carboxamide derivatives US Patent US10195181 Publication Date 2/5/2019
 
E3 ubiquitin-protein ligase SMURF1
Name:E3 ubiquitin-protein ligase SMURF1
Type:PROTEIN
Mol. Mass.:86120.64
Organism:Homo sapiens (Human)
Description:ChEMBL_116984
Residue:757
BDBM239111
NameBDBM239111
Synonyms:US10195181, Example 11 | US9403810, 11
TypeSmall organic molecule
Emp. Form.C24H34N4O5
Mol. Mass.458.5506
SMILESCc1c(onc1C(=O)Nc1c(C)n(C)n(C2CCCCC2)c1=O)C1CCC2(CC1)OCCO2