Reaction Details
TargetE3 ubiquitin-protein ligase SMURF1
LigandBDBM239122
Substrate/Competitorn/a
Meas. Tech.Pharmaceutical Assay
IC50 100.0±n/a nM
Citation Bala, KJBrearley, ADale, JEdwards, AAhmed, MPorter, DPulz, RARooney, LASandham, DAShaw, DSmith, NTaylor, JLTaylor, RJTroxler, TJWrigglesworth, J Carboxamide derivatives US Patent US10195181 Publication Date 2/5/2019
 
E3 ubiquitin-protein ligase SMURF1
Name:E3 ubiquitin-protein ligase SMURF1
Type:PROTEIN
Mol. Mass.:86120.64
Organism:Homo sapiens (Human)
Description:ChEMBL_116984
Residue:757
BDBM239122
NameBDBM239122
Synonyms:US10195181, Example 12 | US9403810, 12
TypeSmall organic molecule
Emp. Form.C26H40N4O5
Mol. Mass.488.6196
SMILESCO[C@@H]1C[C@H](O[C@H](C1)C(C)(C)C)c1onc(C(=O)Nc2c(C)n(C)n(C3CCCCC3)c2=O)c1C