Reaction Details
TargetE3 ubiquitin-protein ligase SMURF1
LigandBDBM331984
Substrate/Competitorn/a
Meas. Tech.Pharmaceutical Assay
IC50 640±n/a nM
Citation Bala, KJBrearley, ADale, JEdwards, AAhmed, MPorter, DPulz, RARooney, LASandham, DAShaw, DSmith, NTaylor, JLTaylor, RJTroxler, TJWrigglesworth, J Carboxamide derivatives US Patent US10195181 Publication Date 2/5/2019
 
E3 ubiquitin-protein ligase SMURF1
Name:E3 ubiquitin-protein ligase SMURF1
Type:PROTEIN
Mol. Mass.:86120.64
Organism:Homo sapiens (Human)
Description:ChEMBL_116984
Residue:757
BDBM331984
NameBDBM331984
Synonyms:A mixture of 5-((2S,4R,6R)-6-(tert-butyl)-4-methoxytetrahydro-2H-pyran-2-yl)-N-(2-cyclohexyl-1,5-dimethyl-3-oxo-2,3-dihydro-1H-pyrazol-4-yl)-4-methylisoxazole-3-carboxamide and 5-((2R,4S,6S)-6-(tert-butyl)-4-methoxytetrahydro-2H-pyran-2-yl)-N-(2-cyclohexyl-1,5-dimethyl-3-oxo-2,3-dihydro-1H-pyrazol-4-yl)-4-methylisoxazole-3-carboxamide US10195181, Example 13b
TypeSmall organic molecule
Emp. Form.C27H44N4O4
Mol. Mass.488.6627
SMILESCO[C@@H]1C[C@@H](O[C@@H](C1)C(C)(C)C)c1onc(C(=O)NC2=C(C)N(C)N(C2C)C2CCCCC2)c1C