Reaction Details
TargetE3 ubiquitin-protein ligase SMURF1
LigandBDBM331988
Substrate/Competitorn/a
Meas. Tech.Pharmaceutical Assay
IC50 290±n/a nM
Citation Bala, KJBrearley, ADale, JEdwards, AAhmed, MPorter, DPulz, RARooney, LASandham, DAShaw, DSmith, NTaylor, JLTaylor, RJTroxler, TJWrigglesworth, J Carboxamide derivatives US Patent US10195181 Publication Date 2/5/2019
 
E3 ubiquitin-protein ligase SMURF1
Name:E3 ubiquitin-protein ligase SMURF1
Type:PROTEIN
Mol. Mass.:86120.64
Organism:Homo sapiens (Human)
Description:ChEMBL_116984
Residue:757
BDBM331988
NameBDBM331988
Synonyms:US10195181, Example 15a | US10195181, Example 15b
TypeSmall organic molecule
Emp. Form.C23H34N4O4
Mol. Mass.430.5405
SMILESCc1c(noc1C1CCC[C@H](O1)C(C)(C)C)C(=O)Nc1c(C)n(C)n(C2CCC2)c1=O