Reaction Details
TargetE3 ubiquitin-protein ligase SMURF1
LigandBDBM331990
Substrate/Competitorn/a
Meas. Tech.Pharmaceutical Assay
IC50 37.0±n/a nM
Citation Bala, KJBrearley, ADale, JEdwards, AAhmed, MPorter, DPulz, RARooney, LASandham, DAShaw, DSmith, NTaylor, JLTaylor, RJTroxler, TJWrigglesworth, J Carboxamide derivatives US Patent US10195181 Publication Date 2/5/2019
 
E3 ubiquitin-protein ligase SMURF1
Name:E3 ubiquitin-protein ligase SMURF1
Type:PROTEIN
Mol. Mass.:86120.64
Organism:Homo sapiens (Human)
Description:ChEMBL_116984
Residue:757
BDBM331990
NameBDBM331990
Synonyms:5-((2S,6R)-6-(tert-butyl)tetrahydro-2H-pyran-2-yl)-N-(2-cyclohexyl-1,5-dimethyl-3-oxo-2,3-dihydro-1H-pyrazol-4-yl)-4-methylisoxazole-3-carboxamide or 5-((2R,6S)-6-(tert-butyl)tetrahydro-2H-pyran-2-yl)-N-(2-cyclohexyl-1,5-dimethyl-3-oxo-2,3-dihydro-1H-pyrazol-4-yl)-4-methylisoxazole-3-carboxamide | US10195181, Example 16
TypeSmall organic molecule
Emp. Form.C25H38N4O4
Mol. Mass.458.5936
SMILESCc1c(noc1[C@H]1CCC[C@H](O1)C(C)(C)C)C(=O)Nc1c(C)n(C)n(C2CCCCC2)c1=O