Reaction Details
TargetE3 ubiquitin-protein ligase SMURF1
LigandBDBM331991
Substrate/Competitorn/a
Meas. Tech.Pharmaceutical Assay
IC50 980±n/a nM
Citation Bala, KJBrearley, ADale, JEdwards, AAhmed, MPorter, DPulz, RARooney, LASandham, DAShaw, DSmith, NTaylor, JLTaylor, RJTroxler, TJWrigglesworth, J Carboxamide derivatives US Patent US10195181 Publication Date 2/5/2019
 
E3 ubiquitin-protein ligase SMURF1
Name:E3 ubiquitin-protein ligase SMURF1
Type:PROTEIN
Mol. Mass.:86120.64
Organism:Homo sapiens (Human)
Description:ChEMBL_116984
Residue:757
BDBM331991
NameBDBM331991
Synonyms:A mixture of 5-((2R,6S)-6-(tert-butyl)tetrahydro-2H-pyran-2-yl)-N-(2-isopropyl-1,5-dimethyl-3-oxo-2,3-dihydro-1H-pyrazol-4-yl)-4-methylisoxazole-3-carboxamide and 5-((2S,6R)-6-(tert-butyl)tetrahydro-2H-pyran-2-yl)-N-(2-isopropyl-1,5-dimethyl-3-oxo-2,3-dihydro-1H-pyrazol-4-yl)-4-methylisoxazole-3-carboxamide | US10195181, Example 17
TypeSmall organic molecule
Emp. Form.C22H34N4O4
Mol. Mass.418.5298
SMILESCC(C)n1n(C)c(C)c(NC(=O)c2noc([C@H]3CCC[C@H](O3)C(C)(C)C)c2C)c1=O