Reaction Details
TargetE3 ubiquitin-protein ligase SMURF1
LigandBDBM239117
Substrate/Competitorn/a
Meas. Tech.Pharmaceutical Assay
IC50 570±n/a nM
Citation Bala, KJBrearley, ADale, JEdwards, AAhmed, MPorter, DPulz, RARooney, LASandham, DAShaw, DSmith, NTaylor, JLTaylor, RJTroxler, TJWrigglesworth, J Carboxamide derivatives US Patent US10195181 Publication Date 2/5/2019
 
E3 ubiquitin-protein ligase SMURF1
Name:E3 ubiquitin-protein ligase SMURF1
Type:PROTEIN
Mol. Mass.:86120.64
Organism:Homo sapiens (Human)
Description:ChEMBL_116984
Residue:757
BDBM239117
NameBDBM239117
Synonyms:US10195181, Example 22c | US9403810, 22
TypeSmall organic molecule
Emp. Form.C22H32N4O4
Mol. Mass.416.5139
SMILESCC1CCC(OC1)c1onc(C(=O)Nc2c(C)n(C)n(C3CCCCC3)c2=O)c1C