Reaction Details
TargetSortilin
LigandBDBM159154
Substrate/Competitorn/a
Meas. Tech.hSortilin Affinity Assay
Ki 543±n/a nM
Citation Maltas, PJWatson, SLanggård, MDavid, L N-substituted-5-substituted phthalamic acids as sortilin inhibitors US Patent US10195186 Publication Date 2/5/2019
 
Sortilin
Name:Sortilin
Type:PROTEIN
Mol. Mass.:92054.53
Organism:Homo sapiens (Human)
Description:ChEMBL_1282402
Residue:831
BDBM159154
NameBDBM159154
Synonyms:US10195186, Example 23 | US9682967, 23
TypeSmall organic molecule
Emp. Form.C15H13BrN2O3
Mol. Mass.349.179
SMILESCc1ccc(NC(=O)c2ccc(Br)cc2C(O)=O)nc1C