Reaction Details
TargetSortilin
LigandBDBM159178
Substrate/Competitorn/a
Meas. Tech.hSortilin Affinity Assay
Ki 467±n/a nM
Citation Maltas, PJWatson, SLanggård, MDavid, L N-substituted-5-substituted phthalamic acids as sortilin inhibitors US Patent US10195186 Publication Date 2/5/2019
 
Sortilin
Name:Sortilin
Type:PROTEIN
Mol. Mass.:92054.53
Organism:Homo sapiens (Human)
Description:ChEMBL_1282402
Residue:831
BDBM159178
NameBDBM159178
Synonyms:US10195186, Example 34 | US9682967, 32
TypeSmall organic molecule
Emp. Form.C13H10BrN3O3
Mol. Mass.336.141
SMILESCc1ccc(NC(=O)c2ccc(Br)cc2C(O)=O)nn1