Reaction Details
TargetSortilin
LigandBDBM50445055
Substrate/Competitorn/a
Meas. Tech.hSortilin Affinity Assay
Ki 190±n/a nM
Citation Maltas, PJWatson, SLanggård, MDavid, L N-substituted-5-substituted phthalamic acids as sortilin inhibitors US Patent US10195186 Publication Date 2/5/2019
 
Sortilin
Name:Sortilin
Type:PROTEIN
Mol. Mass.:92054.53
Organism:Homo sapiens (Human)
Description:ChEMBL_1282402
Residue:831
BDBM50445055
NameBDBM50445055
Synonyms:CHEMBL3098744 US9682967, 43
TypeSmall organic molecule
Emp. Form.C17H18N2O3
Mol. Mass.298.3364
SMILESCC(C)c1ccc(C(=O)Nc2cccc(C)n2)c(c1)C(O)=O