Reaction Details
TargetcGMP-dependent 3',5'-cyclic phosphodiesterase
LigandBDBM331979
Substrate/Competitorn/a
Meas. Tech.TBD
Ki 0.400±n/a nM
Citation Shen, DWilson, JEMcCracken, T Heteroaryl-pyrimidinone compounds as PDE2 inhibitors US Patent US10195201 Publication Date 2/5/2019
 
cGMP-dependent 3',5'-cyclic phosphodiesterase
Name:cGMP-dependent 3',5'-cyclic phosphodiesterase
Type:Enzyme Catalytic Domain
Mol. Mass.:105691.58
Organism:Homo sapiens (Human)
Description:O00408
Residue:941
BDBM331979
NameBDBM331979
Synonyms:(R)- or (S)-2- (3,4-dimethoxy- benzyl)-6-(1-(1- (2-fluoro-4- (trifluoromethyl) phenyl)ethyl)- 1H-imidazol-4- yl)pyrimidin- 4(3H)-one US10195201, Example 19
TypeSmall organic molecule
Emp. Form.C25H22F4N4O3
Mol. Mass.502.4608
SMILESCOc1ccc(Cc2nc(cc(=O)[nH]2)-c2cn(cn2)C(C)c2ccc(cc2F)C(F)(F)F)cc1OC