Reaction Details
TargetCoagulation factor X
LigandBDBM12501
Substrate/CompetitorBDBM12500
Meas. Tech.Factor Xa Inhibition Assay
pH7.8±n/a
Temperature298.15±n/a K
Ki 56±n/a nM
Citation Young, RJCampbell, MBorthwick, ADBrown, DBurns-Kurtis, CLChan, CConvery, MACrowe, MCDayal, SDiallo, HKelly, HAKing, NPKleanthous, SMason, AMMordaunt, JEPatel, CPateman, AJSenger, SShah, GPSmith, PWWatson, NSWeston, HEZhou, P Structure- and property-based design of factor Xa inhibitors: pyrrolidin-2-ones with acyclic alanyl amides as P4 motifs. Bioorg Med Chem Lett16:5953-7 (2006) 
 
Coagulation factor X
Name:Coagulation factor X
Type:Enzyme
Mol. Mass.:54726.60
Organism:Homo sapiens (Human)
Description:n/a
Residue:488
BDBM12501
BDBM12500
NameBDBM12501
Synonyms:(2S)-2-[(3S)-3-[(6-chloronaphthalene-2-)sulfonamido]-2-oxopyrrolidin-1-yl]-N-ethyl-N-methylpropanamide | P4 alanylamide pyrrolidin-2-one 12
TypeSmall organic molecule
Emp. Form.C20H24ClN3O4S
Mol. Mass.437.94
SMILESCCN(C)C(=O)[C@H](C)N1CC[C@H](NS(=O)(=O)c2ccc3cc(Cl)ccc3c2)C1=O