Reaction Details
TargetCoagulation factor X
LigandBDBM12526
Substrate/CompetitorBDBM12500
Meas. Tech.Factor Xa Inhibition Assay
Ki 7±n/a nM
Citation Young, RJCampbell, MBorthwick, ADBrown, DBurns-Kurtis, CLChan, CConvery, MACrowe, MCDayal, SDiallo, HKelly, HAKing, NPKleanthous, SMason, AMMordaunt, JEPatel, CPateman, AJSenger, SShah, GPSmith, PWWatson, NSWeston, HEZhou, P Structure- and property-based design of factor Xa inhibitors: pyrrolidin-2-ones with acyclic alanyl amides as P4 motifs. Bioorg Med Chem Lett16:5953-7 (2006) 
 
Coagulation factor X
Name:Coagulation factor X
Type:Enzyme
Mol. Mass.:54726.60
Organism:Homo sapiens (Human)
Description:n/a
Residue:488
BDBM12526
BDBM12500
NameBDBM12526
Synonyms:(2S)-N-[2-(carbamoylamino)ethyl]-2-[(3S)-3-[(6-chloronaphthalene-2-)sulfonamido]-2-oxopyrrolidin-1-yl]-N-(cyclopropylmethyl)propanamide | P4 alanylamide pyrrolidin-2-one 37
TypeSmall organic molecule
Emp. Form.C24H30ClN5O5S
Mol. Mass.536.044
SMILESC[C@H](N1CC[C@H](NS(=O)(=O)c2ccc3cc(Cl)ccc3c2)C1=O)C(=O)N(CCNC(N)=O)CC1CC1