Reaction Details
TargetCoagulation factor X
LigandBDBM12540
Substrate/CompetitorBDBM12500
Meas. Tech.Factor Xa Inhibition Assay
Ki<1±n/a nM
Citation Young, RJCampbell, MBorthwick, ADBrown, DBurns-Kurtis, CLChan, CConvery, MACrowe, MCDayal, SDiallo, HKelly, HAKing, NPKleanthous, SMason, AMMordaunt, JEPatel, CPateman, AJSenger, SShah, GPSmith, PWWatson, NSWeston, HEZhou, P Structure- and property-based design of factor Xa inhibitors: pyrrolidin-2-ones with acyclic alanyl amides as P4 motifs. Bioorg Med Chem Lett16:5953-7 (2006) 
 
Coagulation factor X
Name:Coagulation factor X
Type:Enzyme
Mol. Mass.:54726.60
Organism:Homo sapiens (Human)
Description:n/a
Residue:488
BDBM12540
BDBM12500
NameBDBM12540
Synonyms:(2S)-N-(2-aminoethyl)-2-[(3S)-3-{2-[(6-chloronaphthalene-2-)sulfonamido]acetamide}-2-oxopyrrolidin-1-yl]-N-(propan-2-yl)propanamide | P4 alanylamide pyrrolidin-2-one 50
TypeSmall organic molecule
Emp. Form.C24H32ClN5O5S
Mol. Mass.538.059
SMILESCC(C)N(CCN)C(=O)[C@H](C)N1CC[C@H](N(CC(N)=O)S(=O)(=O)c2ccc3cc(Cl)ccc3c2)C1=O