Reaction Details
TargetProteasome subunit alpha type-6
LigandBDBM65512
Substrate/Competitorn/a
Meas. Tech.Proteasome Activity Assay
pH7.5±n/a
Temperature310.15±n/a K
EC50>25000±0.0 nM
Commentsextracted
Citation Jones, CLNjomen, ESjögren, BDexheimer, TSTepe, JJ Small Molecule Enhancement of 20S Proteasome Activity Targets Intrinsically Disordered Proteins. ACS Chem Biol12:2240-2247 (2017) 
 
Proteasome subunit alpha type-6
Name:Proteasome subunit alpha type-6
Type:PROTEIN
Mol. Mass.:27399.66
Organism:Homo sapiens (Human)
Description:ChEMBL_106197
Residue:246
BDBM65512
NameBDBM65512
Synonyms:CPZ analog, 6
TypeSmall organic molecule
Emp. Form.C16H10ClNO2S
Mol. Mass.315.774
SMILESOC(=O)C#CCN1c2ccccc2Sc2ccc(Cl)cc12