Reaction Details
Target5-hydroxytryptamine receptor 7
LigandBDBM65507
Substrate/Competitorn/a
Meas. Tech.D2R Binding Assay
Ki>250000±0 nM
Citation Jones, CLNjomen, ESjögren, BDexheimer, TSTepe, JJ Small Molecule Enhancement of 20S Proteasome Activity Targets Intrinsically Disordered Proteins. ACS Chem Biol12:2240-2247 (2017) 
 
5-hydroxytryptamine receptor 7
Name:5-hydroxytryptamine receptor 7
Type:G Protein-Coupled Receptor (GPCR)
Mol. Mass.:53573.08
Organism:Homo sapiens (Human)
Description:P34969
Residue:479
BDBM65507
NameBDBM65507
Synonyms:CPZ analog, 1
TypeSmall organic molecule
Emp. Form.C18H20ClNS
Mol. Mass.317.876
SMILESCC(C)CCCN1c2ccccc2Sc2ccc(Cl)cc12