Reaction Details
TargetG-protein coupled receptor 183
LigandBDBM332551
Substrate/Competitorn/a
Meas. Tech.Cell-Based Luminescent Assay
IC50<5±n/a nM
Citation Pinkerton, ABArdecky, RSergienko, EAGonzalez-Lopez, MGanji, SRZou, J Spirocyclic EBI2 modulators US Patent US10196369 Publication Date 2/5/2019
 
G-protein coupled receptor 183
Name:G-protein coupled receptor 183
Type:PROTEIN
Mol. Mass.:41245.79
Organism:Homo sapiens (Human)
Description:ChEMBL_108311
Residue:361
BDBM332551
NameBDBM332551
Synonyms:(2E)-3-(4-bromophenyl)-1-{2-[(4-chlorophenyl)methyl]-2,7-diazaspiro[3.5]non-7-yl}prop-2-en-1-one | US10196369, Compound C6
TypeSmall organic molecule
Emp. Form.C23H24BrClN2O
Mol. Mass.459.806
SMILESClc1ccc(CN2CC3(C2)CCN(CC3)C(=O)\C=C\c2ccc(Br)cc2)cc1