Reaction Details
TargetG-protein coupled receptor 183
LigandBDBM332588
Substrate/Competitorn/a
Meas. Tech.Cell-Based Luminescent Assay
IC50<5±n/a nM
Citation Pinkerton, ABArdecky, RSergienko, EAGonzalez-Lopez, MGanji, SRZou, J Spirocyclic EBI2 modulators US Patent US10196369 Publication Date 2/5/2019
 
G-protein coupled receptor 183
Name:G-protein coupled receptor 183
Type:PROTEIN
Mol. Mass.:41245.79
Organism:Homo sapiens (Human)
Description:ChEMBL_108311
Residue:361
BDBM332588
NameBDBM332588
Synonyms:4-({2-[(2E)-3-(4-bromophenyl)prop-2-enoyl]-2,7-diazaspiro[3.5]non-7-yl}carbonyl)-2-fluorobenzenecarbonitrile | US10196369, Compound C43
TypeSmall organic molecule
Emp. Form.C24H21BrFN3O2
Mol. Mass.482.345
SMILESFc1cc(ccc1C#N)C(=O)N1CCC2(CN(C2)C(=O)\C=C\c2ccc(Br)cc2)CC1