Reaction Details
TargetG-protein coupled receptor 183
LigandBDBM332599
Substrate/Competitorn/a
Meas. Tech.Cell-Based Luminescent Assay
IC50<5±n/a nM
Citation Pinkerton, ABArdecky, RSergienko, EAGonzalez-Lopez, MGanji, SRZou, J Spirocyclic EBI2 modulators US Patent US10196369 Publication Date 2/5/2019
 
G-protein coupled receptor 183
Name:G-protein coupled receptor 183
Type:PROTEIN
Mol. Mass.:41245.79
Organism:Homo sapiens (Human)
Description:ChEMBL_108311
Residue:361
BDBM332599
NameBDBM332599
Synonyms:(2E)-3-(4-bromophenyl)-1-(2-{[4-(trifluoromethyl)phenyl]carbonyl}-2,7-diazaspiro[3.5]non-7-yl)prop-2-en-1-one | US10196369, Compound C54
TypeSmall organic molecule
Emp. Form.C24H22BrF3N2O2
Mol. Mass.507.343
SMILESFC(F)(F)c1ccc(cc1)C(=O)N1CC2(C1)CCN(CC2)C(=O)\C=C\c1ccc(Br)cc1