Reaction Details
TargetG-protein coupled receptor 183
LigandBDBM332617
Substrate/Competitorn/a
Meas. Tech.Cell-Based Luminescent Assay
IC50<5±n/a nM
Citation Pinkerton, ABArdecky, RSergienko, EAGonzalez-Lopez, MGanji, SRZou, J Spirocyclic EBI2 modulators US Patent US10196369 Publication Date 2/5/2019
 
G-protein coupled receptor 183
Name:G-protein coupled receptor 183
Type:PROTEIN
Mol. Mass.:41245.79
Organism:Homo sapiens (Human)
Description:ChEMBL_108311
Residue:361
BDBM332617
NameBDBM332617
Synonyms:3-(4-bromophenyl)-1-{2-[(4-bromophenyl)methyl]-2,7-diazaspiro[3.5]non-7-yl}prop-2-yn-1-one | US10196369, Compound C72
TypeSmall organic molecule
Emp. Form.C23H22Br2N2O
Mol. Mass.502.242
SMILESBrc1ccc(CN2CC3(C2)CCN(CC3)C(=O)C#Cc2ccc(Br)cc2)cc1