Reaction Details
TargetG-protein coupled receptor 183
LigandBDBM332640
Substrate/Competitorn/a
Meas. Tech.Cell-Based Luminescent Assay
IC50<5±n/a nM
Citation Pinkerton, ABArdecky, RSergienko, EAGonzalez-Lopez, MGanji, SRZou, J Spirocyclic EBI2 modulators US Patent US10196369 Publication Date 2/5/2019
 
G-protein coupled receptor 183
Name:G-protein coupled receptor 183
Type:PROTEIN
Mol. Mass.:41245.79
Organism:Homo sapiens (Human)
Description:ChEMBL_108311
Residue:361
BDBM332640
NameBDBM332640
Synonyms:1-{7-[(4-bromophenyl)carbonyl]-2,7-diazaspiro[3.5]non-2-yl}-3-(4-fluorophenyl)prop-2-yn-1-one | US10196369, Compound C95
TypeSmall organic molecule
Emp. Form.C23H20BrFN2O2
Mol. Mass.455.32
SMILESFc1ccc(cc1)C#CC(=O)N1CC2(C1)CCN(CC2)C(=O)c1ccc(Br)cc1