Reaction Details
TargetCoagulation factor X
LigandBDBM12558
Substrate/CompetitorBDBM12500
Meas. Tech.Factor Xa Inhibition Assay
pH7.8±n/a
Temperature298.15±n/a K
Ki 2±n/a nM
Citation Watson, NSBrown, DCampbell, MChan, CChaudry, LConvery, MAFenwick, RHamblin, JNHaslam, CKelly, HAKing, NPKurtis, CLLeach, ARManchee, GRMason, AMMitchell, CPatel, CPatel, VKSenger, SShah, GPWeston, HEWhitworth, CYoung, RJ Design and synthesis of orally active pyrrolidin-2-one-based factor Xa inhibitors. Bioorg Med Chem Lett16:3784-8 (2006) 
 
Coagulation factor X
Name:Coagulation factor X
Type:Enzyme
Mol. Mass.:54726.60
Organism:Homo sapiens (Human)
Description:n/a
Residue:488
BDBM12558
BDBM12500
NameBDBM12558
Synonyms:6-chloro-N-methyl-N-[(3S)-2-oxo-1-[(2S)-1-oxo-1-(piperidin-1-yl)propan-2-yl]pyrrolidin-3-yl]naphthalene-2-sulfonamide | pyrrolidin-2-one-based inhibitor 6
TypeSmall organic molecule
Emp. Form.C23H28ClN3O4S
Mol. Mass.478.004
SMILESC[C@H](N1CC[C@H](N(C)S(=O)(=O)c2ccc3cc(Cl)ccc3c2)C1=O)C(=O)N1CCCCC1