Reaction Details
TargetProthrombin
LigandBDBM12588
Substrate/CompetitorBDBM12583
Meas. Tech.Thrombin Assay
pH8±n/a
Temperature295.15±n/a K
IC50 1.4±n/a nM
Citation Howard, NAbell, CBlakemore, WChessari, GCongreve, MHoward, SJhoti, HMurray, CWSeavers, LCvan Montfort, RL Application of Fragment Screening and Fragment Linking to the Discovery of Novel Thrombin Inhibitors. J Med Chem49:1346-55 (2006) 
 
Prothrombin
Name:Prothrombin
Type:Protein
Mol. Mass.:70029.57
Organism:Homo sapiens (Human)
Description:P00734
Residue:622
BDBM12588
BDBM12583
NameBDBM12588
Synonyms:(2R,3S)-3-({[5-chloro-2-(1H-1,2,3,4-tetrazol-1-yl)phenyl]methyl}amino)-2-hydroxy-N-(4-methoxy-2,3,6-trimethylphenyl)-4-phenylbutane-1-sulfonamido | benzenesulfonamide-chlorophenyl hybrid compound 6
TypeSmall organic molecule
Emp. Form.C28H33ClN6O4S
Mol. Mass.585.117
SMILESCOc1cc(C)c(c(C)c1C)S(=O)(=O)NC[C@@H](O)[C@H](Cc1ccccc1)NCc1cc(Cl)ccc1-n1cnnn1