Reaction Details
TargetTyrosine-protein kinase ABL1
LigandBDBM332698
Substrate/Competitorn/a
Meas. Tech.In Vitro Biochemical Assay
Ki<1.000±n/a nM
Citation Soellner, MBPhadke, S Inhibitors of BCR-ABL mutants and use thereof US Patent US10196378 Publication Date 2/5/2019
 
Tyrosine-protein kinase ABL1
Name:Tyrosine-protein kinase ABL1
Type:Enzyme
Mol. Mass.:122897.30
Organism:Homo sapiens (Human)
Description:P00519
Residue:1130
BDBM332698
NameBDBM332698
Synonyms:US10196378, Compound C01
TypeSmall organic molecule
Emp. Form.C27H29F3N6O3
Mol. Mass.542.5528
SMILESCNC(=O)c1cc(Oc2ccc(NC(=O)Nc3ccc(CN4CCN(C)CC4)c(c3)C(F)(F)F)cc2)ccn1