Reaction Details
TargetTyrosine-protein kinase ABL1
LigandBDBM332699
Substrate/Competitorn/a
Meas. Tech.In Vitro Biochemical Assay
Ki<1.000±n/a nM
Citation Soellner, MBPhadke, S Inhibitors of BCR-ABL mutants and use thereof US Patent US10196378 Publication Date 2/5/2019
 
Tyrosine-protein kinase ABL1
Name:Tyrosine-protein kinase ABL1
Type:Enzyme
Mol. Mass.:122897.30
Organism:Homo sapiens (Human)
Description:P00519
Residue:1130
BDBM332699
NameBDBM332699
Synonyms:US10196378, Compound C02
TypeSmall organic molecule
Emp. Form.C25H26F3N5O2
Mol. Mass.485.5014
SMILESCN1CCN(Cc2ccc(NC(=O)Nc3ccc(Oc4ccncc4)cc3)cc2C(F)(F)F)CC1