Reaction Details
TargetTyrosine-protein kinase ABL1 [Y253F]
LigandBDBM332702
Substrate/Competitorn/a
Meas. Tech.In Vitro Biochemical Assay
Ki<1.000±n/a nM
Citation Soellner, MBPhadke, S Inhibitors of BCR-ABL mutants and use thereof US Patent US10196378 Publication Date 2/5/2019
 
Tyrosine-protein kinase ABL1 [Y253F]
Name:Tyrosine-protein kinase ABL1 [Y253F]
Type:Enzyme Catalytic Domain
Mol. Mass.:122881.30
Organism:Homo sapiens (Human)
Description:P00519[Y253F]
Residue:1130
BDBM332702
NameBDBM332702
Synonyms:US10196378, Compound C05
TypeSmall organic molecule
Emp. Form.C29H28F3N5O2
Mol. Mass.535.5601
SMILESCN1CCN(Cc2ccc(NC(=O)Nc3ccc(Oc4ccc5ncccc5c4)cc3)cc2C(F)(F)F)CC1