Reaction Details
TargetDipeptidyl peptidase 4
LigandBDBM12635
Substrate/CompetitorBDBM11057
Meas. Tech.DPPIV Inhibition Assay
pH7.5±n/a
Temperature295.15±n/a K
Ki 22±n/a nM
Citation Madar, DJKopecka, HPireh, DYong, HPei, ZLi, XWiedeman, PEDjuric, SWVon Geldern, TWFickes, MGBhagavatula, LMcDermott, TWittenberger, SRichards, SJLongenecker, KLStewart, KDLubben, THBallaron, SJStashko, MALong, MAWells, HZinker, BAMika, AKBeno, DWKempf-Grote, AJPolakowski, JSegreti, JReinhart, GAFryer, RMSham, HLTrevillyan, JM Discovery of 2-[4-{{2-(2S,5R)-2-cyano-5-ethynyl-1-pyrrolidinyl]-2-oxoethyl]amino]-4-methyl-1-piperidinyl]-4-pyridinecarboxylic acid (ABT-279): a very potent, selective, effective, and well-tolerated inhibitor of dipeptidyl peptidase-IV, useful for the treatment of diabetes. J Med Chem49:6416-20 (2006) 
 
Dipeptidyl peptidase 4
Name:Dipeptidyl peptidase 4
Type:Enzyme
Mol. Mass.:88271.01
Organism:Homo sapiens (Human)
Description:P27487
Residue:766
BDBM12635
BDBM11057
NameBDBM12635
Synonyms:(2S,5R)-1-(N-cyclopentylglycyl)-5-ethynylpyrrolidine-2-carbonitrile C5-substituted pyrrolidine 28
TypeSmall organic molecule
Emp. Form.C14H19N3O
Mol. Mass.245.3202
SMILESO=C(CNC1CCCC1)N1[C@H](CC[C@H]1C#N)C#C