Reaction Details
TargetDipeptidyl peptidase 4
LigandBDBM12639
Substrate/CompetitorBDBM11057
Meas. Tech.DPPIV Inhibition Assay
Ki 25±n/a nM
Citation Madar, DJKopecka, HPireh, DYong, HPei, ZLi, XWiedeman, PEDjuric, SWVon Geldern, TWFickes, MGBhagavatula, LMcDermott, TWittenberger, SRichards, SJLongenecker, KLStewart, KDLubben, THBallaron, SJStashko, MALong, MAWells, HZinker, BAMika, AKBeno, DWKempf-Grote, AJPolakowski, JSegreti, JReinhart, GAFryer, RMSham, HLTrevillyan, JM Discovery of 2-[4-{{2-(2S,5R)-2-cyano-5-ethynyl-1-pyrrolidinyl]-2-oxoethyl]amino]-4-methyl-1-piperidinyl]-4-pyridinecarboxylic acid (ABT-279): a very potent, selective, effective, and well-tolerated inhibitor of dipeptidyl peptidase-IV, useful for the treatment of diabetes. J Med Chem49:6416-20 (2006) 
 
Dipeptidyl peptidase 4
Name:Dipeptidyl peptidase 4
Type:Enzyme
Mol. Mass.:88271.01
Organism:Homo sapiens (Human)
Description:P27487
Residue:766
BDBM12639
BDBM11057
NameBDBM12639
Synonyms:(2S,5R)-1-(N-(tert-butyl)glycyl)-5-ethynylpyrrolidine-2-carbonitrile C5-substituted pyrrolidine 32
TypeSmall organic molecule
Emp. Form.C13H19N3O
Mol. Mass.233.3095
SMILESCC(C)(C)NCC(=O)N1[C@H](CC[C@H]1C#N)C#C