Reaction Details
TargetDipeptidyl peptidase 8
LigandBDBM12643
Substrate/CompetitorBDBM11057
Meas. Tech.DPPIV Inhibition Assay
Ki 110±n/a nM
Citation Madar, DJKopecka, HPireh, DYong, HPei, ZLi, XWiedeman, PEDjuric, SWVon Geldern, TWFickes, MGBhagavatula, LMcDermott, TWittenberger, SRichards, SJLongenecker, KLStewart, KDLubben, THBallaron, SJStashko, MALong, MAWells, HZinker, BAMika, AKBeno, DWKempf-Grote, AJPolakowski, JSegreti, JReinhart, GAFryer, RMSham, HLTrevillyan, JM Discovery of 2-[4-{{2-(2S,5R)-2-cyano-5-ethynyl-1-pyrrolidinyl]-2-oxoethyl]amino]-4-methyl-1-piperidinyl]-4-pyridinecarboxylic acid (ABT-279): a very potent, selective, effective, and well-tolerated inhibitor of dipeptidyl peptidase-IV, useful for the treatment of diabetes. J Med Chem49:6416-20 (2006) 
 
Dipeptidyl peptidase 8
Name:Dipeptidyl peptidase 8
Type:Enzyme
Mol. Mass.:103342.62
Organism:Homo sapiens (Human)
Description:Q6V1X1
Residue:898
BDBM12643
BDBM11057
NameBDBM12643
Synonyms:6-{[4-({2-[(2S)-2-cyanopyrrolidin-1-yl]-2-oxoethyl}amino)cyclohexyl]oxy}pyridine-3-carbonitrile | Cyanopyrrolidine 37
TypeSmall organic molecule
Emp. Form.C19H23N5O2
Mol. Mass.353.4182
SMILESO=C(CNC1CC[C@@H](CC1)Oc1ccc(cn1)C#N)N1CCC[C@H]1C#N