Reaction Details
TargetCoagulation factor X
LigandBDBM12662
Substrate/CompetitorBDBM12658
Meas. Tech.Enzyme Assay and Determination of the Inhibition Constants.
pH7±n/a
Temperature295.15±n/a K
Ki 0.51±n/a nM
Citation Quan, MLLam, PYHan, QPinto, DJHe, MYLi, REllis, CDClark, CGTeleha, CASun, JHAlexander, RSBai, SLuettgen, JMKnabb, RMWong, PCWexler, RR Discovery of 1-(3'-aminobenzisoxazol-5'-yl)-3-trifluoromethyl-N-[2-fluoro-4-[(2'-dimethylaminomethyl)imidazol-1-yl]phenyl]-1H-pyrazole-5-carboxyamide hydrochloride (razaxaban), a highly potent, selective, and orally bioavailable factor Xa inhibitor. J Med Chem48:1729-44 (2005) 
 
Coagulation factor X
Name:Coagulation factor X
Type:Enzyme
Mol. Mass.:54726.60
Organism:Homo sapiens (Human)
Description:n/a
Residue:488
BDBM12662
BDBM12658
NameBDBM12662
Synonyms:1-(3-Aminobenzisoxazol-5-yl)-3-trifluoromethyl-5-[4-(1-methylimidazol-2-yl)-2-fluorophenyl)aminocarbonyl]-Bis(trifluoroacetic acid) Salt Razaxaban Analogue | aminobenzisoxazole 28
TypeSmall organic molecule
Emp. Form.C22H15F4N7O2
Mol. Mass.485.3938
SMILESCn1ccnc1-c1ccc(NC(=O)c2cc(nn2-c2ccc3onc(N)c3c2)C(F)(F)F)c(F)c1