Reaction Details
TargetProthrombin
LigandBDBM12669
Substrate/CompetitorBDBM12678
Meas. Tech.Enzyme Assay and Determination of the Inhibition Constants.
Ki 200±n/a nM
Citation Quan, MLLam, PYHan, QPinto, DJHe, MYLi, REllis, CDClark, CGTeleha, CASun, JHAlexander, RSBai, SLuettgen, JMKnabb, RMWong, PCWexler, RR Discovery of 1-(3'-aminobenzisoxazol-5'-yl)-3-trifluoromethyl-N-[2-fluoro-4-[(2'-dimethylaminomethyl)imidazol-1-yl]phenyl]-1H-pyrazole-5-carboxyamide hydrochloride (razaxaban), a highly potent, selective, and orally bioavailable factor Xa inhibitor. J Med Chem48:1729-44 (2005) 
 
Prothrombin
Name:Prothrombin
Type:Protein
Mol. Mass.:70029.57
Organism:Homo sapiens (Human)
Description:P00734
Residue:622
BDBM12669
BDBM12678
NameBDBM12669
Synonyms:1-(3-Aminobenzisoxazol-5-yl)-3-trifluoromethyl-5-[[(2-methoxy-4-(2-methylimidazol-1-yl)phenyl]aminocarbonyl]pyrazole, Bis(trifluoroacetic acid) Salt Razaxaban Analogue | aminobenzisoxazole 45
TypeSmall organic molecule
Emp. Form.C23H18F3N7O3
Mol. Mass.497.4293
SMILESCOc1cc(ccc1NC(=O)c1cc(nn1-c1ccc2onc(N)c2c1)C(F)(F)F)-n1ccnc1C