Reaction Details
TargetNon-receptor tyrosine-protein kinase TYK2
LigandBDBM332882
Substrate/Competitorn/a
Meas. Tech.Tyk2 & JAK2 Caliper Assay
Ki<10±n/a nM
Citation Masse, CEGreenwood, JRRomero, DLHarriman, GCWester, RTShelley, MKennedy-Smith, JJDahlgren, M TYK2 inhibitors and uses thereof US Patent US10196390 Publication Date 2/5/2019
 
Non-receptor tyrosine-protein kinase TYK2
Name:Non-receptor tyrosine-protein kinase TYK2
Type:Protein
Mol. Mass.:133666.03
Organism:Homo sapiens (Human)
Description:P29597
Residue:1187
BDBM332882
NameBDBM332882
Synonyms:US10196390, Compound I-171 US11040967, Compound 8
TypeSmall organic molecule
Emp. Form.C22H19F2N5O2
Mol. Mass.423.4154
SMILESFc1cccc(F)c1-c1cc(Nc2ccc(cn2)N2CCOCC2)c2C(=O)NCc2n1