Reaction Details
TargetNon-receptor tyrosine-protein kinase TYK2
LigandBDBM332923
Substrate/Competitorn/a
Meas. Tech.Tyk2 & JAK2 Caliper Assay
Ki<10±n/a nM
Citation Masse, CEGreenwood, JRRomero, DLHarriman, GCWester, RTShelley, MKennedy-Smith, JJDahlgren, M TYK2 inhibitors and uses thereof US Patent US10196390 Publication Date 2/5/2019
 
Non-receptor tyrosine-protein kinase TYK2
Name:Non-receptor tyrosine-protein kinase TYK2
Type:Protein
Mol. Mass.:133666.03
Organism:Homo sapiens (Human)
Description:P29597
Residue:1187
BDBM332923
NameBDBM332923
Synonyms:US10196390, Compound I-212
TypeSmall organic molecule
Emp. Form.C23H19F2N5O3
Mol. Mass.451.4255
SMILESFc1cccc(F)c1-c1cc(Nc2ccc(cn2)C(=O)N2CCOCC2)c2C(=O)NCc2n1