Reaction Details
TargetNon-receptor tyrosine-protein kinase TYK2
LigandBDBM332928
Substrate/Competitorn/a
Meas. Tech.Tyk2 & JAK2 Caliper Assay
Ki<10±n/a nM
Citation Masse, CEGreenwood, JRRomero, DLHarriman, GCWester, RTShelley, MKennedy-Smith, JJDahlgren, M TYK2 inhibitors and uses thereof US Patent US10196390 Publication Date 2/5/2019
 
Non-receptor tyrosine-protein kinase TYK2
Name:Non-receptor tyrosine-protein kinase TYK2
Type:Protein
Mol. Mass.:133666.03
Organism:Homo sapiens (Human)
Description:P29597
Residue:1187
BDBM332928
NameBDBM332928
Synonyms:US10196390, Compound I-217
TypeSmall organic molecule
Emp. Form.C24H22F2N6O2
Mol. Mass.464.4673
SMILESCN1CCN[C@](C)(C1=O)c1ccc(Nc2nc(nc3CNC(=O)c23)-c2c(F)cccc2F)cc1