Reaction Details
TargetNon-receptor tyrosine-protein kinase TYK2
LigandBDBM332974
Substrate/Competitorn/a
Meas. Tech.Tyk2 & JAK2 Caliper Assay
Ki<10±n/a nM
Citation Masse, CEGreenwood, JRRomero, DLHarriman, GCWester, RTShelley, MKennedy-Smith, JJDahlgren, M TYK2 inhibitors and uses thereof US Patent US10196390 Publication Date 2/5/2019
 
Non-receptor tyrosine-protein kinase TYK2
Name:Non-receptor tyrosine-protein kinase TYK2
Type:Protein
Mol. Mass.:133666.03
Organism:Homo sapiens (Human)
Description:P29597
Residue:1187
BDBM332974
NameBDBM332974
Synonyms:US10196390, Compound I-263
TypeSmall organic molecule
Emp. Form.C24H23F2N5O2
Mol. Mass.451.4685
SMILESC[C@@H]1COC[C@@H](C)N1c1ccc(Nc2cc(nc3CNC(=O)c23)-c2c(F)cccc2F)nc1