Reaction Details
TargetTyrosine-protein kinase JAK2
LigandBDBM332981
Substrate/Competitorn/a
Ki<10±n/a nM
Citation Masse, CEGreenwood, JRRomero, DLHarriman, GCWester, RTShelley, MKennedy-Smith, JJDahlgren, M TYK2 inhibitors and uses thereof US Patent US10196390 Publication Date 2/5/2019
 
Tyrosine-protein kinase JAK2
Name:Tyrosine-protein kinase JAK2
Type:Protein
Mol. Mass.:130684.68
Organism:Homo sapiens (Human)
Description:O60674
Residue:1132
BDBM332981
NameBDBM332981
Synonyms:US10196390, Compound I-270
TypeSmall organic molecule
Emp. Form.C23H21F2N5O2
Mol. Mass.437.4419
SMILESO[C@H]1CCCN(C1)c1ccc(Nc2cc(nc3CNC(=O)c23)-c2c(F)cccc2F)nc1