Reaction Details
TargetTyrosine-protein kinase JAK2
LigandBDBM332989
Substrate/Competitorn/a
Ki<10±n/a nM
Citation Masse, CEGreenwood, JRRomero, DLHarriman, GCWester, RTShelley, MKennedy-Smith, JJDahlgren, M TYK2 inhibitors and uses thereof US Patent US10196390 Publication Date 2/5/2019
 
Tyrosine-protein kinase JAK2
Name:Tyrosine-protein kinase JAK2
Type:Protein
Mol. Mass.:130684.68
Organism:Homo sapiens (Human)
Description:O60674
Residue:1132
BDBM332989
NameBDBM332989
Synonyms:US10196390, Compound I-278
TypeSmall organic molecule
Emp. Form.C22H21F2N5O
Mol. Mass.409.4318
SMILESCC(C)(C)Nc1ccc(Nc2cc(nc3CNC(=O)c23)-c2c(F)cccc2F)nc1